Target
D(2) dopamine receptor
Ligand
BDBM50004823
Substrate
Ki
4268±n/a nM
Comments
PDSP_5205
Citation
 Chipkin, REIorio, LCCoffin, VLMcQuade, RDBerger, JGBarnett, A Pharmacological profile of SCH39166: a dopamine D1 selective benzonaphthazepine with potential antipsychotic activity. J Pharmacol Exp Ther 247:1093-102 (1988) Target
Name:
D(2) dopamine receptor
Synonyms:
DOPAMINE D2 DOPAMINE D2 Short Dopamine D2 receptor Drd2
Type:
G Protein-Coupled Receptor (GPCR)
Mol. Mass.:
50931.60
Organism:
Rattus norvegicus (rat)
Description:
P61169
Residue:
444
  
Inhibitor
Name:
BDBM50004823
Synonyms:
(6aS,13bR)-11-Chloro-7-methyl-5,6a,7,8,9,13b-hexahydro-6H-7-aza-benzo[6,7]cyclohepta[1,2-a]naphthalen-12-ol 11-Chloro-7-methyl-5,6a,7,8,9,13b-hexahydro-6H-7-aza-benzo[6,7]cyclohepta[1,2-a]naphthalen-12-ol Ecopipam trans-(-) 11-Chloro-7-methyl-5,6a,7,8,9,13b-hexahydro-6H-7-aza-benzo[6,7]cyclohepta[1,2-a]naphthalen-12-ol
Type:
Small organic molecule
Emp. Form.:
C19H20ClNO
Mol. Mass.:
313.821
SMILES:
CN1CCc2cc(Cl)c(O)cc2[C@@H]2[C@@H]1CCc1ccccc21
: