Target
Envelope glycoprotein gp160
Ligand
BDBM271365
Substrate
Meas. Tech.
MT4 Cell Antiviral Assay
EC50
5.20±n/a nM
Citation
 Johns, BA Compounds and compositions for treating HIV with derivatives of Betulin US Patent  US10064873 Publication Date 9/4/2018 
Target
Name:
Envelope glycoprotein gp160
Synonyms:
Env polyprotein | NL4-3
Type:
Enzyme Catalytic Domain
Mol. Mass.:
97031.14
Organism:
Human immunodeficiency virus type 1 (isolate BRU/LAI group M subtypeB) (HIV-1)
Description:
Residue:
854
  
Inhibitor
Name:
BDBM271365
Synonyms:
4-[(1R)-1- [(1R,2R,5R,10S,13R,14R, 17S,19R)-17-[(3- carboxy-3,3- dimethylpropanoyl)oxy]- 1,2,14,18,18- pentamethyl-7-oxo-8- (propan-2- yl)pentacyclo[11.8.0.0{circumflex over ()} {2,10}.0{circumflex over ()}{5,9}.0{circumflex over ()}{14,19}] henicos-8-en-5-yl]-2-{[(4- chlorophenyl)methyl][2- (dimethylamino)ethyl] amino}ethoxy]-2,2-dimethyl- 4-oxobutanoic acid | US10064873, Example 2
Type:
Small organic molecule
Emp. Form.:
C54H81ClN2O9
Mol. Mass.:
937.682
SMILES:
[H][C@]12CC[C@]3([H])[C@@]4(C)CC[C@H](OC(=O)CC(C)(C)C(O)=O)C(C)(C)[C@]4([H])CC[C@@]3(C)[C@]1(C)CC[C@]1(CC(=O)C(C(C)C)=C21)[C@H](CN(CCN(C)C)Cc1ccc(Cl)cc1)OC(=O)CC(C)(C)C(O)=O
: