Target
Adenosine receptor A1
Ligand
BDBM82013
Substrate
Ki
6.8±n/a nM
Comments
PDSP_2819
Citation
 Schwabe, UUkena, DLohse, MJ Xanthine derivatives as antagonists at A1 and A2 adenosine receptors. Naunyn Schmiedebergs Arch Pharmacol 330:212-21 (1985)  
Target
Name:
Adenosine receptor A1
Synonyms:
AA1R_RAT ADENOSINE A1 high Adenosine A1 receptor (A1) Adenosine receptors A1 | Adora1
Type:
Protein
Mol. Mass.:
36704.13
Organism:
Rattus norvegicus (rat)
Description:
Residue:
326
  
Inhibitor
Name:
BDBM82013
Synonyms:
8-(2-Amino-4-chloro-phenyl)-1,3-dipropyl-3,7-dihydro-purine-2,6-dione(PACPX) CAS_92411 NSC_92411 | PACPX
Type:
Small organic molecule
Emp. Form.:
C17H20ClN5O2
Mol. Mass.:
361.826
SMILES:
CCCn1c2nc([nH]c2c(=O)n(CCC)c1=O)-c1ccc(Cl)cc1N
: