Target
Voltage-dependent L-type calcium channel subunit alpha-1C
Ligand
BDBM50004704
Substrate
Ki
281±n/a nM
Comments
PDSP_670
Citation
 Reynolds, IJSnowman, AMSnyder, SH (-)-[3H] desmethoxyverapamil labels multiple calcium channel modulator receptors in brain and skeletal muscle membranes: differentiation by temperature and dihydropyridines. J Pharmacol Exp Ther 237:731-8 (1986) Target
Name:
Voltage-dependent L-type calcium channel subunit alpha-1C
Synonyms:
CAC1C_RAT Cacn2 Cacnl1a1 Calcium channel (Type L) Calcium channel, L type, alpha-1 polypeptide, isoform 1, cardiac muscle RBC Voltage-dependent L-type calcium channel subunit alpha-1C Voltage-gated L-type calcium channel alpha-1C subunit | Voltage-gated calcium channel subunit alpha Cav1.2
Type:
Enzyme Catalytic Domain
Mol. Mass.:
243492.26
Organism:
RAT
Description:
Calcium channel 0 RAT::P22002
Residue:
2169
  
Inhibitor
Name:
BDBM50004704
Synonyms:
(+)-cis-Diltiazem 5-(2-dimethylamino-ethyl)-2-(4-methoxy-phenyl)-4-oxo-2,3,4,5-tetrahydro-benzo[b][1,4]thiazepin-3-yl ester(Diltiazem)Acetic acid Acetic acid (2S,3S)-5-(2-dimethylamino-ethyl)-2-(4-methoxy-phenyl)-4-oxo-2,3,4,5-tetrahydro-benzo[b][1,4]thiazepin-3-yl ester Acetic acid 5-(2-dimethylamino-ethyl)-2-(4-methoxy-phenyl)-4-oxo-2,3,4,5-tetrahydro-benzo[b][1,4]thiazepin-3-yl ester Acetic acid 5-(2-dimethylamino-ethyl)-2-(4-methoxy-phenyl)-4-oxo-2,3,4,5-tetrahydro-benzo[b][1,4]thiazepin-3-yl ester(cis-(+)-Diltiazem) CHEMBL23 DILTIAZEM Diltzac Tiamate cis-Acetic acid 5-(2-dimethylamino-ethyl)-2-(4-methoxy-phenyl)-4-oxo-2,3,4,5-tetrahydro-benzo[b][1,4]thiazepin-3-yl ester | diltiazem;Acetic acid 5-(2-dimethylamino-ethyl)-2-(4-methoxy-phenyl)-4-oxo-2,3,4,5-tetrahydro-benzo[b][1,4]thiazepin-3-yl ester
Type:
Small organic molecule
Emp. Form.:
C22H26N2O4S
Mol. Mass.:
414.518
SMILES:
COc1ccc(cc1)[C@@H]1Sc2ccccc2N(CCN(C)C)C(=O)[C@@H]1OC(C)=O
: