Target
Voltage-dependent L-type calcium channel subunit alpha-1C
Ligand
BDBM82056
Substrate
Ki
2.79±n/a nM
Comments
PDSP_2655
Citation
 Reynolds, IJSnowman, AMSnyder, SH (-)-[3H] desmethoxyverapamil labels multiple calcium channel modulator receptors in brain and skeletal muscle membranes: differentiation by temperature and dihydropyridines. J Pharmacol Exp Ther 237:731-8 (1986) Target
Name:
Voltage-dependent L-type calcium channel subunit alpha-1C
Synonyms:
CAC1C_RAT Cacn2 Cacnl1a1 Calcium channel (Type L) Calcium channel, L type, alpha-1 polypeptide, isoform 1, cardiac muscle RBC Voltage-dependent L-type calcium channel subunit alpha-1C Voltage-gated L-type calcium channel alpha-1C subunit | Voltage-gated calcium channel subunit alpha Cav1.2
Type:
Enzyme Catalytic Domain
Mol. Mass.:
243492.26
Organism:
RAT
Description:
Calcium channel 0 RAT::P22002
Residue:
2169
  
Inhibitor
Name:
BDBM82056
Synonyms:
CAS_4499 Nisoldipine
Type:
Small organic molecule
Emp. Form.:
C20H24N2O6
Mol. Mass.:
388.4144
SMILES:
COC(=O)C1C(C(C(=O)OCC(C)C)=C(C)N=C1C)c1ccccc1[N+]([O-])=O
: