Target
Beta-arrestin-1
Ligand
BDBM50004665
Substrate
Ki
214±n/a nM
Comments
PDSP_1426
Citation
 Bloom, JWHalonen, MLawrence, LJRould, ESeaver, NAYamamura, HI Characterization of high affinity [3H]pirenzepine and (-)-[3H] quinuclidinyl benzilate binding to muscarinic cholinergic receptors in rabbit peripheral lung. J Pharmacol Exp Ther 240:51-8 (1987) Target
Name:
Beta-arrestin-1
Synonyms:
ARRB1 Beta-arrestin-1 OPIATE Delta | PAF Platelet activating factor
Type:
Enzyme Catalytic Domain
Mol. Mass.:
46360.54
Organism:
RABBIT
Description:
Cholinergic, muscarinic 0 RABBIT::Q95223
Residue:
410
  
Inhibitor
Name:
BDBM50004665
Synonyms:
(oxotremorine)1-(4-Pyrrolidin-1-yl-but-2-ynyl)-pyrrolidin-2-one 1-(4-Pyrrolidin-1-yl-but-2-ynyl)-pyrrolidin-2-one (oxotremorphine) 1-[4-(2-oxo-pyrrolidin-1-yl)-but-2-ynyl]-pyrrolidinium Oxotremorine cid_4630
Type:
Small organic molecule
Emp. Form.:
C12H18N2O
Mol. Mass.:
206.2841
SMILES:
O=C1CCCN1CC#CCN1CCCC1
: