Target
Sigma non-opioid intracellular receptor 1
Ligand
BDBM50060582
Substrate
Ki
>10000±n/a nM
Comments
PDSP_632
Citation
 Largent, BLGundlach, ALSnyder, SH Psychotomimetic opiate receptors labeled and visualized with (+)-[3H]3-(3-hydroxyphenyl)-N-(1-propyl)piperidine. Proc Natl Acad Sci U S A 81:4983-7 (1984)  
Target
Name:
Sigma non-opioid intracellular receptor 1
Synonyms:
Opioid receptor SGMR1_RAT Sigma non-opioid intracellular receptor 1 Sigma-1 | Sigmar1
Type:
Enzyme Catalytic Domain
Mol. Mass.:
25266.54
Organism:
RAT
Description:
Q9R0C9
Residue:
223
  
Inhibitor
Name:
BDBM50060582
Synonyms:
1,10-Bis(trimethyl ammonium)decane dibromide CHEMBL1134 DECAMETHONIUM BROMIDE N,N,N'',N''-Tetramethyl-decane-1,10-diammonium; dibromide Syncurine | decane-1,10-bis(trimethylammonium bromide)
Type:
Small organic molecule
Emp. Form.:
C16H38N2
Mol. Mass.:
258.4852
SMILES:
C[N+](C)(C)CCCCCCCCCC[N+](C)(C)C
: