Target
Myosin light chain kinase, smooth muscle
Ligand
BDBM2579
Substrate
Myosin Light-Chain
Meas. Tech.
MLCK assay
pH
7.2±n/a
Temperature
303.15±n/a K
IC50
10±n/a nM
Citation
 Kleinschroth, JHartenstein, JRudolph, CSchachtele, C Novel Indolocarbazole protein kinase C inhibitors with improved biochemical and physicochemical properties. Bioorg Med Chem Lett 5:55-60 (1995)    Article 
Target
Name:
Myosin light chain kinase, smooth muscle
Synonyms:
MLCK Mylk Telokin
Type:
Enzyme
Mol. Mass.:
210423.57
Organism:
Gallus gallus (chicken)
Description:
Residue:
1906
  
Inhibitor
Name:
BDBM2579
Synonyms:
(2S,3R,4R,6R)-3-methoxy-2-methyl-4-(methylamino)-29-oxa-1,7,17-triazaoctacyclo[12.12.2.1^{2,6}.0^{7,28}.0^{8,13}.0^{15,19}.0^{20,27}.0^{21,26}]nonacosa-8(13),9,11,14(28),15(19),20(27),21(26),22,24-nonaen-16-one Staurosporin, 4 Staurosporine, 8 US9206188, Staurosporine | US9226923, Staurosporine
Type:
Small organic molecule
Emp. Form.:
C28H26N4O3
Mol. Mass.:
466.531
SMILES:
CN[C@@H]1C[C@H]2O[C@@](C)([C@@H]1OC)n1c3ccccc3c3c4CNC(=O)c4c4c5ccccc5n2c4c13
:
Substrate
Name:
Myosin Light-Chain
Synonyms:
MYL6 | MYL6_CHICK
Type:
Peptide
Mol. Mass.:
16974.98
Organism:
Gallus gallus (chicken)
Description:
250 uM ATP (0.3 uCi [gamma-32P]ATP) as co-substrate.
Residue:
151