Target
Myosin light chain kinase, smooth muscle
Ligand
BDBM3033
Substrate
Myosin Light-Chain
Meas. Tech.
MLCK assay
pH
7.2±n/a
Temperature
303.15±n/a K
IC50
5800±n/a nM
Citation
 Kleinschroth, JHartenstein, JRudolph, CSchachtele, C Novel Indolocarbazole protein kinase C inhibitors with improved biochemical and physicochemical properties. Bioorg Med Chem Lett 5:55-60 (1995)    Article 
Target
Name:
Myosin light chain kinase, smooth muscle
Synonyms:
MLCK Mylk Telokin
Type:
Enzyme
Mol. Mass.:
210423.57
Organism:
Gallus gallus (chicken)
Description:
Residue:
1906
  
Inhibitor
Name:
BDBM3033
Synonyms:
3-{23-methyl-14-oxo-3,13,23-triazahexacyclo[14.7.0.0^{2,10}.0^{4,9}.0^{11,15}.0^{17,22}]tricosa-1(16),2(10),4(9),5,7,11(15),17,19,21-nonaen-3-yl}propanenitrile Go 6976 | Indolocarbazole deriv.
Type:
Small organic molecule
Emp. Form.:
C24H18N4O
Mol. Mass.:
378.4259
SMILES:
Cn1c2ccccc2c2c3C(=O)NCc3c3c4ccccc4n(CCC#N)c3c12
:
Substrate
Name:
Myosin Light-Chain
Synonyms:
MYL6 | MYL6_CHICK
Type:
Peptide
Mol. Mass.:
16974.98
Organism:
Gallus gallus (chicken)
Description:
250 uM ATP (0.3 uCi [gamma-32P]ATP) as co-substrate.
Residue:
151