Target
cGMP-dependent protein kinase 1
Ligand
BDBM3034
Substrate
Histone II-A
Meas. Tech.
cGPK assay
IC50
2000±n/a nM
Citation
 Kleinschroth, JHartenstein, JRudolph, CSchachtele, C Novel Indolocarbazole protein kinase C inhibitors with improved biochemical and physicochemical properties. Bioorg Med Chem Lett 5:55-60 (1995)    Article 
Target
Name:
cGMP-dependent protein kinase 1
Synonyms:
CGK 1 alpha PRKG1 PRKGR1A cGMP-Dependent Protein Kinase cGMP-dependent protein kinase 1, alpha isozyme
Type:
Enzyme
Mol. Mass.:
76413.14
Organism:
Bos taurus (bovine)
Description:
Residue:
671
  
Inhibitor
Name:
BDBM3034
Synonyms:
3-{7,19-dimethoxy-23-methyl-14-oxo-3,13,23-triazahexacyclo[14.7.0.0^{2,10}.0^{4,9}.0^{11,15}.0^{17,22}]tricosa-1(16),2(10),4(9),5,7,11(15),17,19,21-nonaen-3-yl}propanenitrile | Indolocarbazole deriv. 3b
Type:
Small organic molecule
Emp. Form.:
C26H22N4O3
Mol. Mass.:
438.4779
SMILES:
COc1ccc2n(C)c3c(c4C(=O)NCc4c4c5cc(OC)ccc5n(CCC#N)c34)c2c1
:
Substrate
Name:
Histone II-A
Synonyms:
Type:
Other Protein Type
Mol. Mass.:
358.43
Organism:
Description:
Unfractionated whole histone. 10 uM ATP (0.3 uCi [gamma-32P]ATP) as co-substrate.
Residue:
3
NA