Target
Histamine H2 receptor
Ligand
BDBM22889
Substrate
Ki
470±n/a nM
Comments
PDSP_519
Citation
 Gajtkowski, GANorris, DBRising, TJWood, TP Specific binding of 3H-tiotidine to histamine H2 receptors in guinea pig cerebral cortex. Nature 304:65-7 (1983)  
Target
Name:
Histamine H2 receptor
Synonyms:
Gastric receptor I HISTAMINE H2 HRH2_CAVPO | Histamine H2-Gs alpha S
Type:
G Protein-Coupled Receptor (GPCR)
Mol. Mass.:
40567.22
Organism:
Cavia porcellus (domestic guinea pig)
Description:
For the H2 receptor-binding assays, guinea pig striatum was used.
Residue:
359
  
Inhibitor
Name:
BDBM22889
Synonyms:
(Cimetidine) N-Methyl-N''''-[2-(5-methyl-1H-imidazol-4-ylmethylsulfanyl)-ethyl]-guanidine,cyanide (cimetidine) N-methyl-N-[2-(5-methyl-1H-4-imidazolylmethylsulfanyl)ethyl]cyanoiminomethanediamine 1-cyano-2-methyl-3-(2-{[(5-methyl-1H-imidazol-4-yl)methyl]sulfanyl}ethyl)guanidine 2-Methyl-8-phenethyl-imidazo[1,2-a]pyridine-3-carboxylic acid methyl ester(cimetidine) 2-methylamino-2-[2-(5-methyl-1H-4-imidazolylmethylsulfanyl)ethylamino]-(Z)-1-imino cyanide(cimetidine) CHEMBL30 Eureceptor N''''''''-cyano-N-methyl-N''''-(2-{[(5-methyl-1H-imidazol-4-yl)methyl]-lambda~4~-sulfanyl}ethyl)guanidine N''''''''-cyano-N-methyl-N''''-(2-{[(5-methyl-1H-imidazol-4-yl)methyl]thio}ethyl)guanidine (Cimetidine) N''''''''-cyano-N-methyl-N''''-({[(5-methyl-1H-imidazol-4-yl)methyl]thio}methyl)guanidine(cimetidine) N-Methyl-N''''-[2-(5-methyl-1H-imidazol-4-ylmethylsulfanyl)-ethyl]-N''''''''-Cyano-guanidine N-Methyl-N''''-[2-(5-methyl-1H-imidazol-4-ylmethylsulfanyl)-ethyl]-cyanoguanidine(cimetidine) N-methyl-N''''-cyano-N''''''''-[2-(5-methyl-1H-imidazol-4-ylmethylsulfanyl)-ethyl]-guanidine N-methyl-N-[2-(5-methyl-1H-4-imidazolylmethylsulfanyl)ethyl]cyanoiminomethanediamine (cimetidine) N-tert-Butyl-N''''-[4-(1H-imidazol-4-yl)-phenyl]-formamidine(cimetidine) Tagamet HB cemitidine
Type:
Small organic molecule
Emp. Form.:
C10H16N6S
Mol. Mass.:
252.339
SMILES:
CNC(NC#N)=NCCSCc1[nH]cnc1C
: