Target
Alpha-2C adrenergic receptor
Ligand
BDBM29568
Substrate
Ki
1827±n/a nM
Comments
PDSP_1528
Citation
 Doxey, JCLane, ACRoach, AGVirdee, NK Comparison of the alpha-adrenoceptor antagonist profiles of idazoxan (RX 781094), yohimbine, rauwolscine and corynanthine. Naunyn Schmiedebergs Arch Pharmacol 325:136-44 (1984)  
Target
Name:
Alpha-2C adrenergic receptor
Synonyms:
ADA2C_RAT Adrenergic receptor alpha adrenergic Alpha2 | adrenergic Alpha2C
Type:
Enzyme Catalytic Domain
Mol. Mass.:
49890.50
Organism:
RAT
Description:
adrenergic Alpha2 0 RAT::P22086
Residue:
458
  
Inhibitor
Name:
BDBM29568
Synonyms:
CHEMBL2 PRAZOSIN HYDROCHLORIDE [3H]-Minipress [3H]-Prazosin
Type:
radiolabeled ligand
Emp. Form.:
C19H21N5O4
Mol. Mass.:
383.4011
SMILES:
COc1cc2nc(nc(N)c2cc1OC)N1CCN(CC1)C(=O)c1ccco1
: