Target
Alpha-1A adrenergic receptor
Ligand
BDBM79181
Substrate
Ki
24±n/a nM
Comments
PDSP_1908
Citation
 Richelson, ENelson, A Antagonism by neuroleptics of neurotransmitter receptors of normal human brain in vitro. Eur J Pharmacol 103:197-204 (1984)  
Target
Name:
Alpha-1A adrenergic receptor
Synonyms:
ADA1A_HUMAN ADRA1C Alpha 1A-adrenoceptor Alpha adrenergic receptor 1a Alpha-adrenergic receptor 1c adrenergic Alpha1 | adrenergic Alpha1C
Type:
Cell-surface receptors
Mol. Mass.:
51511.67
Organism:
Homo sapiens (Human)
Description:
P35348
Residue:
466
  
Inhibitor
Name:
BDBM79181
Synonyms:
10-[3-(4-methyl-1-piperazinyl)propyl]-2-(trifluoromethyl)phenothiazine;hydrochloride 10-[3-(4-methylpiperazino)propyl]-2-(trifluoromethyl)phenothiazine;hydrochloride SMR000059133 TRIFLUOPERAZINE DIHYDROCHLORIDE US11542290, Compound Trifluoperazine cid_5566
Type:
Small organic molecule
Emp. Form.:
C21H24F3N3S
Mol. Mass.:
407.496
SMILES:
CN1CCN(CCCN2c3ccccc3Sc3ccc(cc23)C(F)(F)F)CC1
: