Target
D(2) dopamine receptor
Ligand
BDBM50130273
Substrate
Ki
1.4±n/a nM
Comments
PDSP_1456
Citation
 Richelson, ENelson, A Antagonism by neuroleptics of neurotransmitter receptors of normal human brain in vitro. Eur J Pharmacol 103:197-204 (1984)  
Target
Name:
D(2) dopamine receptor
Synonyms:
D(2) dopamine receptor DOPAMINE D2 Long DRD2 Dopamine D2 receptor Dopamine D2 receptor (D2R) Dopamine2-like | d2
Type:
Cell-surface receptors
Mol. Mass.:
50647.10
Organism:
Homo sapiens (Human)
Description:
P14416
Residue:
443
  
Inhibitor
Name:
BDBM50130273
Synonyms:
2-(4-[3-(2-chloro-10H-phenothiazin-10-yl)propyl]-1-piperazinyl)ethanol 2-{4-[3-(2-chloro-10H-phenothiazin-10-yl)propyl]piperazin-1-yl}ethanol 4-[3-(2-chlorophenothiazin-10-yl)propyl]-1-piperazineethanol Chlorpiprazine Perfenazine Trilafon | gamma-(4-(beta-hydroxyethyl)piperazin-1-yl)propyl-2-chlorophenothiazine
Type:
Small organic molecule
Emp. Form.:
C21H26ClN3OS
Mol. Mass.:
403.969
SMILES:
OCCN1CCN(CCCN2c3ccccc3Sc3ccc(Cl)cc23)CC1
: