Target
Reverse transcriptase
Ligand
BDBM82101
Substrate
Meas. Tech.
In Vitro Enzyme Assay
pH
7.8±0
Temperature
310.15±0 K
IC50
8.71e+4±n/a nM
Citation
 Bustanji, YAl-Masri, IMQasem, AAl-Bakri, AGTaha, MO In silico screening for non-nucleoside HIV-1 reverse transcriptase inhibitors using physicochemical filters and high-throughput docking followed by in vitro evaluation. Chem Biol Drug Des 74:258-65 (2009)  
Target
Name:
Reverse transcriptase
Synonyms:
Type:
PROTEIN
Mol. Mass.:
64758.82
Organism:
Human immunodeficiency virus 2
Description:
ChEMBL_725038
Residue:
560
  
Inhibitor
Name:
BDBM82101
Synonyms:
NCI Code, 4179
Type:
Small organic molecule
Emp. Form.:
C13H10Cl2O3S
Mol. Mass.:
317.188
SMILES:
Cc1ccc(cc1)S(=O)(=O)Oc1ccc(Cl)cc1Cl
: