Target
Carbonic anhydrase 2
Ligand
BDBM82103
Substrate
Meas. Tech.
Inhibition Assay
pH
7.5±0
Temperature
293.15±0 K
Ki
10±0.0 nM
Citation
 De Simone, GScozzafava, ASupuran, CT Which carbonic anhydrases are targeted by the antiepileptic sulfonamides and sulfamates? Chem Biol Drug Des 74:317-21 (2009)  
Target
Name:
Carbonic anhydrase 2
Synonyms:
CA-II CAC Carbonate dehydratase II Carbonic anhydrase 2 (CA-II) Carbonic anhydrase C Carbonic anhydrase II (CA-II) Carbonic anhydrase II (hCA II) | Carbonic anhydrase isoenzyme II (hCA II)
Type:
Enzyme
Mol. Mass.:
29250.71
Organism:
Homo sapiens (Human)
Description:
P00918
Residue:
260
  
Inhibitor
Name:
BDBM82103
Synonyms:
Investigational agent, 4
Type:
Small organic molecule
Emp. Form.:
C13H18N4O3S2
Mol. Mass.:
342.437
SMILES:
NS(=O)(=O)c1nnc(NC(=O)[C@]23C[C@H]4C[C@H](C[C@H](C4)C2)C3)s1
: