Target
Carbonic anhydrase 5B, mitochondrial
Ligand
BDBM82103
Substrate
Meas. Tech.
Inhibition Assay
pH
7.5±0
Temperature
293.15±0 K
Ki
34±0.0 nM
Citation
 De Simone, GScozzafava, ASupuran, CT Which carbonic anhydrases are targeted by the antiepileptic sulfonamides and sulfamates? Chem Biol Drug Des 74:317-21 (2009)  
Target
Name:
Carbonic anhydrase 5B, mitochondrial
Synonyms:
CA-VB CAH5B_HUMAN Carbonic Anhydrase VB Carbonic anhydrase 5B, mitochondrial Carbonic anhydrase V | Carbonic anhydrase VB (CA VB)
Type:
Enzyme
Mol. Mass.:
36440.83
Organism:
Homo sapiens (Human)
Description:
Human (cloned) isozyme
Residue:
317
  
Inhibitor
Name:
BDBM82103
Synonyms:
Investigational agent, 4
Type:
Small organic molecule
Emp. Form.:
C13H18N4O3S2
Mol. Mass.:
342.437
SMILES:
NS(=O)(=O)c1nnc(NC(=O)[C@]23C[C@H]4C[C@H](C[C@H](C4)C2)C3)s1
: