Target
Carbonic anhydrase 9
Ligand
BDBM82104
Substrate
Meas. Tech.
Inhibition Assay
pH
7.5±0
Temperature
293.15±0 K
Ki
7.8±0.0 nM
Citation
 De Simone, GScozzafava, ASupuran, CT Which carbonic anhydrases are targeted by the antiepileptic sulfonamides and sulfamates? Chem Biol Drug Des 74:317-21 (2009)  
Target
Name:
Carbonic anhydrase 9
Synonyms:
CA-IX CAH9_HUMAN Carbonic anhydrase 9 (CA IX) Carbonic anhydrase 9 precursor Carbonic anhydrase IX (CAIX) Carbonic anhydrases; II & IX MN RCC-associated antigen G250
Type:
Enzyme
Mol. Mass.:
49669.03
Organism:
Homo sapiens (Human)
Description:
Catalytic domain of human cloned isozyme was used in the assay
Residue:
459
  
Inhibitor
Name:
BDBM82104
Synonyms:
Investigational agent, 5
Type:
Small organic molecule
Emp. Form.:
C13H19N5O3S2
Mol. Mass.:
357.452
SMILES:
NS(=O)(=O)c1nnc(NC(=O)N[C@]23C[C@H]4C[C@H](C[C@H](C4)C2)C3)s1
: