Target
P2X purinoceptor 3
Ligand
BDBM271512
Substrate
Meas. Tech.
Humna P2X3 Binding Assay
pH
7.5±n/a
IC50
58.0±n/a nM
Comments
extracted
Citation
 Kai, H Aminotriazine derivative and pharmaceutical composition comprising the same US Patent  US10065941 Publication Date 9/4/2018 
Target
Name:
P2X purinoceptor 3
Synonyms:
ATP receptor P2RX3 P2X purinoceptor 3 P2X purinoceptor 3 (P2X3) P2X3 purinoceptor p2x3 + hsa
Type:
Protein
Mol. Mass.:
44292.02
Organism:
Homo sapiens (Human)
Description:
P56373
Residue:
397
  
Inhibitor
Name:
BDBM271512
Synonyms:
US10065941, Compound I-013 | US9732060, Compound I-013
Type:
Small organic molecule
Emp. Form.:
C27H25Cl2N5O5
Mol. Mass.:
570.424
SMILES:
COC(=O)[C@H](C)[C@H](C)n1c(=O)[nH]\c(=N/c2ccc(Oc3cccc(Cl)n3)cc2)n(Cc2ccc(Cl)cc2)c1=O
: