Target
P2X purinoceptor 3
Ligand
BDBM272056
Substrate
Meas. Tech.
Humna P2X3 Binding Assay
pH
7.5±n/a
IC50
4.00±n/a nM
Comments
extracted
Citation
 Kai, H Aminotriazine derivative and pharmaceutical composition comprising the same US Patent  US10065941 Publication Date 9/4/2018 
Target
Name:
P2X purinoceptor 3
Synonyms:
ATP receptor P2RX3 P2X purinoceptor 3 P2X purinoceptor 3 (P2X3) P2X3 purinoceptor p2x3 + hsa
Type:
Protein
Mol. Mass.:
44292.02
Organism:
Homo sapiens (Human)
Description:
P56373
Residue:
397
  
Inhibitor
Name:
BDBM272056
Synonyms:
US10065941, Compound I-277 | US9732060, Compound I-277
Type:
Small organic molecule
Emp. Form.:
C27H26ClN5O7S
Mol. Mass.:
600.043
SMILES:
COC(=O)[C@@H](C)Cn1c(=O)[nH]\c(=N/c2ccc(Oc3ccc(cn3)S(C)(=O)=O)cc2)n(Cc2ccc(Cl)cc2)c1=O
: