Target
Endoplasmic reticulum chaperone BiP
Ligand
BDBM82125
Substrate
Meas. Tech.
SPR assay
pH
7.4±0
Temperature
298.15±0 K
Kd
9.9e+2±n/a nM
KOFF
>1 s-1
Citation
 Macias, ATWilliamson, DSAllen, NBorgognoni, JClay, ADaniels, ZDokurno, PDrysdale, MJFrancis, GLGraham, CJHowes, RMatassova, NMurray, JBParsons, RShaw, TSurgenor, AETerry, LWang, YWood, MMassey, AJ Adenosine-derived inhibitors of 78 kDa glucose regulated protein (Grp78) ATPase: insights into isoform selectivity. J Med Chem 54:4034-41 (2011)  
Target
Name:
Endoplasmic reticulum chaperone BiP
Synonyms:
3.6.4.10 BIP_HUMAN Binding-immunoglobulin protein Endoplasmic reticulum lumenal Ca(2+)-binding protein grp78 GRP78 HSPA5 Heat shock protein 70 family protein 5 Immunoglobulin heavy chain-binding protein | Synonyms=GRP78
Type:
Mol. Mass.:
72312.92
Organism:
Homo sapiens (Human)
Description:
P11021
Residue:
654
  
Inhibitor
Name:
BDBM82125
Synonyms:
(2R,3R,4S,5R)-2-(6-Amino-8-methylaminopurin-9-yl)-5- benzyloxymethyltetrahydrofuran-3,4-diol | adenosine-derived inhibitor (Grp78), 4
Type:
Small organic molecule
Emp. Form.:
C18H22N6O4
Mol. Mass.:
386.4051
SMILES:
CNc1nc2c(N)ncnc2n1[C@@H]1O[C@H](COCc2ccccc2)[C@@H](O)[C@H]1O
: