Target
Endoplasmic reticulum chaperone BiP
Ligand
BDBM32375
Substrate
Meas. Tech.
SPR assay
pH
7.4±0
Temperature
298.15±0 K
Kd
2.3e+2±n/a nM
KOFF
0.2 s-1
Citation
 Macias, ATWilliamson, DSAllen, NBorgognoni, JClay, ADaniels, ZDokurno, PDrysdale, MJFrancis, GLGraham, CJHowes, RMatassova, NMurray, JBParsons, RShaw, TSurgenor, AETerry, LWang, YWood, MMassey, AJ Adenosine-derived inhibitors of 78 kDa glucose regulated protein (Grp78) ATPase: insights into isoform selectivity. J Med Chem 54:4034-41 (2011)  
Target
Name:
Endoplasmic reticulum chaperone BiP
Synonyms:
3.6.4.10 BIP_HUMAN Binding-immunoglobulin protein Endoplasmic reticulum lumenal Ca(2+)-binding protein grp78 GRP78 HSPA5 Heat shock protein 70 family protein 5 Immunoglobulin heavy chain-binding protein | Synonyms=GRP78
Type:
Mol. Mass.:
72312.92
Organism:
Homo sapiens (Human)
Description:
P11021
Residue:
654
  
Inhibitor
Name:
BDBM32375
Synonyms:
adenosine-derived inhibitor (Grp78), 9 | adenosine-derived inhibitor, 9
Type:
Small organic molecule
Emp. Form.:
C20H21N7O4
Mol. Mass.:
423.4252
SMILES:
Nc1ncnc2n([C@@H]3O[C@H](CO)[C@@H](O)[C@H]3O)c(NCc3ccc4ncccc4c3)nc12
: