Target
Proto-oncogene tyrosine-protein kinase Src
Ligand
BDBM50293992
Substrate
Meas. Tech.
In Vitro Kinase Assay
IC50
84±0.0 nM
Citation
 Zhou, TCommodore, LHuang, WSWang, YSawyer, TKShakespeare, WCClackson, TZhu, XDalgarno, DC Structural analysis of DFG-in and DFG-out dual Src-Abl inhibitors sharing a common vinyl purine template. Chem Biol Drug Des 75:18-28 (2010)  
Target
Name:
Proto-oncogene tyrosine-protein kinase Src
Synonyms:
Calmodulin/Proto-oncogene tyrosine-protein kinase Src Proto-oncogene c-Src SRC SRC_HUMAN V-src sarcoma (Schmidt-Ruppin A-2) viral oncogene homolog (avian) p60-Src | pp60c-src
Type:
Protein
Mol. Mass.:
59838.60
Organism:
Homo sapiens (Human)
Description:
P12931
Residue:
536
  
Inhibitor
Name:
BDBM50293992
Synonyms:
(E)-3-(2-(Purin-9-yl)vinyl)-4-methyl-N-(3-(4-methyl-1-imidazol-1-yl)-5-(trifluoromethyl)phenyl)benzamide CHEMBL559838
Type:
Small organic molecule
Emp. Form.:
C26H20F3N7O
Mol. Mass.:
503.4785
SMILES:
Cc1cn(cn1)-c1cc(NC(=O)c2ccc(C)c(\C=C\n3cnc4cncnc34)c2)cc(c1)C(F)(F)F
: