Target
Cannabinoid receptor 1
Ligand
BDBM82134
Substrate
Meas. Tech.
Binding Assay
pH
7.4±0
Temperature
298.15±0 K
Ki
553±36.1 nM
Citation
 Mazzoni, ODiurno, MVdi Bosco, AMNovellino, EGrieco, PEsposito, GBertamino, ACalignano, ARusso, R Synthesis and pharmacological evaluation of analogs of indole-based cannabimimetic agents. Chem Biol Drug Des 75:106-14 (2010)  
Target
Name:
Cannabinoid receptor 1
Synonyms:
Brain-type cannabinoid receptor CB-R CNR1_RAT Cannabinoid receptor Cnr1 | Skr6
Type:
G Protein-Coupled Receptor (GPCR)
Mol. Mass.:
52856.55
Organism:
Rattus norvegicus (rat)
Description:
P20272
Residue:
473
  
Inhibitor
Name:
BDBM82134
Synonyms:
3-(Arylimino)-1-(2-morpholin-4-yl-ethyl)-1,3-dihydro-indole-2-one, 4
Type:
Small organic molecule
Emp. Form.:
C24H23N3O2
Mol. Mass.:
385.4583
SMILES:
O=C1N(CCN2CCOCC2)c2ccccc2\C1=N\c1cccc2ccccc12
: