Target
5-hydroxytryptamine receptor 2A
Ligand
BDBM82182
Substrate
Meas. Tech.
Competition Binding Assay
pH
7.4±0
Temperature
310.15±0 K
Ki
356±56 nM
Citation
 Kramer, VHerth, MMSantini, MAPalner, MKnudsen, GMRösch, F Structural combination of established 5-HT(2A) receptor ligands: new aspects of the binding mode. Chem Biol Drug Des 76:361-6 (2010)  
Target
Name:
5-hydroxytryptamine receptor 2A
Synonyms:
5-HT-2 5-HT2A 5-hydroxytryptamine receptor 2A (5HT-2A) 5HT2A_HUMAN HTR2A | Serotonin receptor 2A
Type:
undefined
Mol. Mass.:
52607.65
Organism:
Homo sapiens (Human)
Description:
P28223
Residue:
471
  
Inhibitor
Name:
BDBM82182
Synonyms:
3-[2-(4-{[3-(2-fluoroethoxy)-2-methoxyphenyl](hydroxy)methyl}piperidin-1-yl)ethyl]-2-sulfanylidene-1,2,3,4-tetrahydroquinazolin-4-one, 4c
Type:
Small organic molecule
Emp. Form.:
C25H30FN3O4S
Mol. Mass.:
487.587
SMILES:
COc1c(OCCF)cccc1C(O)C1CCN(CCn2c(=S)[nH]c3ccccc3c2=O)CC1
: