Target
Delta-aminolevulinic acid dehydratase
Ligand
BDBM82198
Substrate
Meas. Tech.
PBGS Assay
pH
8.1±0
Temperature
310.15±0 K
Ki
2.8e+4±n/a nM
Citation
 Stauffer, FZizzari, EEngeloch-Jarret, CFaurite, JPBobálová, JNeier, R Inhibition studies of porphobilinogen synthase from Escherichia coli differentiating between the two recognition sites. Chembiochem 2:343-54 (2001)  
Target
Name:
Delta-aminolevulinic acid dehydratase
Synonyms:
HEM2_ECOLI hemB | ncf
Type:
Enzyme
Mol. Mass.:
35617.37
Organism:
Escherichia coli
Description:
P0ACB2
Residue:
324
  
Inhibitor
Name:
BDBM82198
Synonyms:
Substrate analogue, 17
Type:
Small organic molecule
Emp. Form.:
C4H7NO3
Mol. Mass.:
117.1033
SMILES:
CC(=O)CCN(=O)=O
: