Target
Delta-aminolevulinic acid dehydratase
Ligand
BDBM82199
Substrate
Meas. Tech.
PBGS Assay
pH
8.1±0
Temperature
310.15±0 K
Ki
2.1e+4±n/a nM
Citation
 Stauffer, FZizzari, EEngeloch-Jarret, CFaurite, JPBobálová, JNeier, R Inhibition studies of porphobilinogen synthase from Escherichia coli differentiating between the two recognition sites. Chembiochem 2:343-54 (2001)  
Target
Name:
Delta-aminolevulinic acid dehydratase
Synonyms:
HEM2_ECOLI hemB | ncf
Type:
Enzyme
Mol. Mass.:
35617.37
Organism:
Escherichia coli
Description:
P0ACB2
Residue:
324
  
Inhibitor
Name:
BDBM82199
Synonyms:
Substrate analogue, 18
Type:
Small organic molecule
Emp. Form.:
C4H6FNO3
Mol. Mass.:
135.0937
SMILES:
FCC(=O)CCN(=O)=O
: