Target
Cholecystokinin
Ligand
BDBM18137
Substrate
Ki
1000±n/a nM
Comments
PDSP_2560
Citation
 Van Dijk, ARichards, JGTrzeciak, AGillessen, DMöhler, H Cholecystokinin receptors: biochemical demonstration and autoradiographical localization in rat brain and pancreas using [3H] cholecystokinin8 as radioligand. J Neurosci 4:1021-33 (1984) Target
Name:
Cholecystokinin
Synonyms:
CCKN_RAT | Cck
Type:
Enzyme Catalytic Domain
Mol. Mass.:
12844.29
Organism:
RAT
Description:
Cholecystokinin 0 RAT::P01355
Residue:
115
  
Inhibitor
Name:
BDBM18137
Synonyms:
AMP US11185100, TABLE 7.3 adenosine 5 -monophosphate | {[(2R,3S,4R,5R)-5-(6-amino-9H-purin-9-yl)-3,4-dihydroxyoxolan-2-yl]methoxy}phosphonic acid
Type:
Nucleoside or nucleotide
Emp. Form.:
C10H14N5O7P
Mol. Mass.:
347.2212
SMILES:
Nc1ncnc2n(cnc12)[C@@H]1O[C@H](COP(O)(O)=O)[C@@H](O)[C@H]1O
: