Target
Cholecystokinin
Ligand
BDBM82240
Substrate
Ki
1000±n/a nM
Comments
PDSP_2670
Citation
 Van Dijk, ARichards, JGTrzeciak, AGillessen, DMöhler, H Cholecystokinin receptors: biochemical demonstration and autoradiographical localization in rat brain and pancreas using [3H] cholecystokinin8 as radioligand. J Neurosci 4:1021-33 (1984) Target
Name:
Cholecystokinin
Synonyms:
CCKN_RAT | Cck
Type:
Enzyme Catalytic Domain
Mol. Mass.:
12844.29
Organism:
RAT
Description:
Cholecystokinin 0 RAT::P01355
Residue:
115
  
Inhibitor
Name:
BDBM82240
Synonyms:
CAS_3027 Dibutyryl-cGMP | NSC_3027
Type:
Small organic molecule
Emp. Form.:
C17H23N5O9P
Mol. Mass.:
472.3669
SMILES:
CCCC(=O)Nc1nc2N(CNc2c(=O)[nH]1)C1OC2OP([O-])(=O)OC2C1OC(=O)CCC
: