Target
Cholecystokinin
Ligand
BDBM81791
Substrate
Ki
1000±n/a nM
Comments
PDSP_2688
Citation
 Van Dijk, ARichards, JGTrzeciak, AGillessen, DMöhler, H Cholecystokinin receptors: biochemical demonstration and autoradiographical localization in rat brain and pancreas using [3H] cholecystokinin8 as radioligand. J Neurosci 4:1021-33 (1984) Target
Name:
Cholecystokinin
Synonyms:
CCKN_RAT | Cck
Type:
Enzyme Catalytic Domain
Mol. Mass.:
12844.29
Organism:
RAT
Description:
Cholecystokinin 0 RAT::P01355
Residue:
115
  
Inhibitor
Name:
BDBM81791
Synonyms:
Dopamine + GPP(NH)p GPP(NH)p(-) | Guanylyl imidodiphosphate
Type:
Emp. Form.:
C10H17N6O13P3
Mol. Mass.:
522.1957
SMILES:
Nc1nc2n(cnc2c(=O)[nH]1)[C@@H]1O[C@H](COP(O)(=O)OP(O)(=O)NP(O)(O)=O)[C@@H](O)[C@H]1O
: