Target
Metabotropic glutamate receptor 1
Ligand
BDBM50030629
Substrate
Ki
>10000±n/a nM
Comments
PDSP_4814
Citation
 Thomsen, CBoel, ESuzdak, PD Actions of phenylglycine analogs at subtypes of the metabotropic glutamate receptor family. Eur J Pharmacol 267:77-84 (1994)  
Target
Name:
Metabotropic glutamate receptor 1
Synonyms:
GRM1_RAT Grm1 Metabotropic glutamate receptor Mglur1 metabotropic glutamate 1/5-D metabotropic glutamate receptor 1 isoform alpha precursor
Type:
Enzyme Catalytic Domain
Mol. Mass.:
133240.47
Organism:
RAT
Description:
metabotropic glutamate 1/2 0 RAT::P23385
Residue:
1199
  
Inhibitor
Name:
BDBM50030629
Synonyms:
(R,S)-4-Carboxy-3-hydroxyphenylglycine 4-(Amino-carboxy-methyl)-benzoic acid 4CPG | CHEMBL328984
Type:
Small organic molecule
Emp. Form.:
C9H9NO4
Mol. Mass.:
195.1721
SMILES:
NC(C(O)=O)c1ccc(cc1)C(O)=O
: