Target
Metabotropic glutamate receptor 4
Ligand
BDBM50030629
Substrate
Ki
>10000±n/a nM
Comments
PDSP_4814
Citation
 Thomsen, CBoel, ESuzdak, PD Actions of phenylglycine analogs at subtypes of the metabotropic glutamate receptor family. Eur J Pharmacol 267:77-84 (1994)  
Target
Name:
Metabotropic glutamate receptor 4
Synonyms:
GRM4_RAT Grm4 Metabotropic glutamate receptor 4 (mGlu4) mGlu4 metabotropic glutamate 4a
Type:
Enzyme
Mol. Mass.:
101849.79
Organism:
Rattus norvegicus (Rat)
Description:
P31423
Residue:
912
  
Inhibitor
Name:
BDBM50030629
Synonyms:
(R,S)-4-Carboxy-3-hydroxyphenylglycine 4-(Amino-carboxy-methyl)-benzoic acid 4CPG | CHEMBL328984
Type:
Small organic molecule
Emp. Form.:
C9H9NO4
Mol. Mass.:
195.1721
SMILES:
NC(C(O)=O)c1ccc(cc1)C(O)=O
: