Target
Histone deacetylase 9
Ligand
BDBM272080
Substrate
Meas. Tech.
HDAC9 Biochemicle Assay
IC50
31.0±n/a nM
Citation
 Dominguez, CMuñoz-Sanjuán, IBürli, RWLuckhurst, CAAllen, DRRaphy, GBreccia, PHaughan, AFWishart, GHughes, SJJarvis, REVater, HDPenrose, SDWall, MStott, AJSaville-Stones, EA Histone deacetylase inhibitors and compositions and methods of use thereof US Patent  US10065948 Publication Date 9/4/2018 
Target
Name:
Histone deacetylase 9
Synonyms:
HD9 HDAC7B HDAC9_HUMAN Histone acetylase 9 (HDAC9) Histone deacetylase 9 (HDAC9) Human HDAC9 MITR
Type:
Enzyme
Mol. Mass.:
111304.31
Organism:
Homo sapiens (Human)
Description:
Q9UKV0
Residue:
1011
  
Inhibitor
Name:
BDBM272080
Synonyms:
(S)-5-(3-Fluoro-2-methylphenyl)-1-(5-fluoropyridin-2- yl)-N-hydroxy-1,4,5,6- tetrahydrocyclopenta[c]pyrazole-5-carboxamide US10457675, Example 16
Type:
Small organic molecule
Emp. Form.:
C19H16F2N4O2
Mol. Mass.:
370.3527
SMILES:
Cc1c(F)cccc1[C@@]1(Cc2cnn(c2C1)-c1ccc(F)cn1)C(=O)NO
: