Target
Histone deacetylase 9
Ligand
BDBM272108
Substrate
Meas. Tech.
HDAC9 Biochemicle Assay
IC50
1000±n/a nM
Citation
 Dominguez, CMuñoz-Sanjuán, IBürli, RWLuckhurst, CAAllen, DRRaphy, GBreccia, PHaughan, AFWishart, GHughes, SJJarvis, REVater, HDPenrose, SDWall, MStott, AJSaville-Stones, EA Histone deacetylase inhibitors and compositions and methods of use thereof US Patent  US10065948 Publication Date 9/4/2018 
Target
Name:
Histone deacetylase 9
Synonyms:
HD9 HDAC7B HDAC9_HUMAN Histone acetylase 9 (HDAC9) Histone deacetylase 9 (HDAC9) Human HDAC9 MITR
Type:
Enzyme
Mol. Mass.:
111304.31
Organism:
Homo sapiens (Human)
Description:
Q9UKV0
Residue:
1011
  
Inhibitor
Name:
BDBM272108
Synonyms:
6-(3-Fluoro-2-methylphenyl)-N-hydroxy-4,5,6,7- tetrahydrobenzo[d]thiazole-6-carboxamide US10457675, Example 44
Type:
Small organic molecule
Emp. Form.:
C15H15FN2O2S
Mol. Mass.:
306.355
SMILES:
Cc1c(F)cccc1C1(CCc2ncsc2C1)C(=O)NO
: