Target
Histone deacetylase 9
Ligand
BDBM272135
Substrate
Meas. Tech.
HDAC9 Biochemicle Assay
IC50
95.0±n/a nM
Citation
 Dominguez, CMuñoz-Sanjuán, IBürli, RWLuckhurst, CAAllen, DRRaphy, GBreccia, PHaughan, AFWishart, GHughes, SJJarvis, REVater, HDPenrose, SDWall, MStott, AJSaville-Stones, EA Histone deacetylase inhibitors and compositions and methods of use thereof US Patent  US10065948 Publication Date 9/4/2018 
Target
Name:
Histone deacetylase 9
Synonyms:
HD9 HDAC7B HDAC9_HUMAN Histone acetylase 9 (HDAC9) Histone deacetylase 9 (HDAC9) Human HDAC9 MITR
Type:
Enzyme
Mol. Mass.:
111304.31
Organism:
Homo sapiens (Human)
Description:
Q9UKV0
Residue:
1011
  
Inhibitor
Name:
BDBM272135
Synonyms:
(R)-5-(3-Fluoro-2-methylphenyl)-N-hydroxy-2-(5- methoxypyridin-2-yl)-5,6-dihydro-4H- cyclopenta[d]thiazole-5-carboxamide US10457675, Example 71
Type:
Small organic molecule
Emp. Form.:
C20H18FN3O3S
Mol. Mass.:
399.439
SMILES:
COc1ccc(nc1)-c1nc2C[C@](Cc2s1)(C(=O)NO)c1cccc(F)c1C
: