Target
Somatostatin receptor type 2
Ligand
BDBM81767
Substrate
Ki
0.28±n/a nM
Comments
PDSP_1735
Citation
 Rossowski, WJGu, ZFAkarca, USJensen, RTCoy, DH Characterization of somatostatin receptor subtypes controlling rat gastric acid and pancreatic amylase release. Peptides 15:1421-4 (1994)  
Target
Name:
Somatostatin receptor type 2
Synonyms:
SOMATOSTATIN SST2 SS2R Somatostatin receptor Somatostatin receptor type 2 | Sstr2
Type:
Enzyme Catalytic Domain
Mol. Mass.:
41212.21
Organism:
RAT
Description:
SOMATOSTATIN SST2 SSTR2 RAT::P30680
Residue:
369
  
Inhibitor
Name:
BDBM81767
Synonyms:
15-28-Somatostatin-28 CB6417646 | Somatostatin-14
Type:
Small organic molecule
Emp. Form.:
C76H104N18O19S2
Mol. Mass.:
1637.878
SMILES:
C[C@@H](O)[C@@H]1NC(=O)[C@H](Cc2ccccc2)NC(=O)[C@@H](NC(=O)[C@H](CCCCN)NC(=O)[C@H](Cc2c[nH]c3ccccc23)NC(=O)[C@H](Cc2ccccc2)NC(=O)[C@H](Cc2ccccc2)NC(=O)[C@H](CC(N)=O)NC(=O)[C@H](CCCCN)NC(=O)[C@H](CSSC[C@H](NC(=O)[C@H](CO)NC1=O)C(O)=O)NC(=O)CNC(=O)[C@H](C)N)[C@@H](C)O
: