Target
Type-2 angiotensin II receptor
Ligand
BDBM82260
Substrate
Ki
1.3±n/a nM
Comments
PDSP_1938
Citation
 Kushida, HNomura, SMorita, OHarasawa, YSuzuki, MNakano, MOzawa, KKunihara, M Pharmacological characterization of the nonpeptide angiotensin II receptor antagonist, U-97018. J Pharmacol Exp Ther 274:1042-53 (1995) Target
Name:
Type-2 angiotensin II receptor
Synonyms:
AGTR2_RAT Agtr2 Angiotensin II receptor Type-2 angiotensin II receptor
Type:
Enzyme Catalytic Domain
Mol. Mass.:
41346.62
Organism:
RAT
Description:
Angiotensin II AT2 0 0::P35351
Residue:
363
  
Inhibitor
Name:
BDBM82260
Synonyms:
U-97018
Type:
Small organic molecule
Emp. Form.:
C29H32N8O
Mol. Mass.:
508.6174
SMILES:
[H]C12CCC([H])(CC1)N1N2Cc2nc(CCCC)n(Cc3ccc(cc3)-c3ccccc3-c3nnn[nH]3)c2C1=O
: