Target
Substance-K receptor
Ligand
BDBM82263
Substrate
Ki
41±n/a nM
Comments
PDSP_565
Citation
 Aharony, DBuckner, CKEllis, JLGhanekar, SVGraham, AKays, JSLittle, JMeeker, SMiller, SCUndem, BJ Pharmacological characterization of a new class of nonpeptide neurokinin A antagonists that demonstrate species selectivity. J Pharmacol Exp Ther 274:1216-21 (1995) Target
Name:
Substance-K receptor
Synonyms:
NK2R_MESAU Neurokinin NK2 TACR2
Type:
Enzyme Catalytic Domain
Mol. Mass.:
43436.75
Organism:
HAMSTER
Description:
P51144
Residue:
384
  
Inhibitor
Name:
BDBM82263
Synonyms:
COMPOUND II
Type:
Emp. Form.:
C22H27ClN6O3
Mol. Mass.:
458.941
SMILES:
Clc1ccc(Nc2nc(nc3C(=O)N(CCN4CCOCC4)Cc23)N2CCOCC2)cc1
: