Target
Glutamate receptor ionotropic, NMDA 1
Ligand
BDBM82270
Substrate
Ki
180±n/a nM
Comments
PDSP_1440
Citation
 Bresink, IDanysz, WParsons, CGMutschler, E Different binding affinities of NMDA receptor channel blockers in various brain regions--indication of NMDA receptor heterogeneity. Neuropharmacology 34:533-40 (1995)  
Target
Name:
Glutamate receptor ionotropic, NMDA 1
Synonyms:
Glutamate (NMDA) receptor subunit zeta 1 Glutamate-NMDA-Channel Glutamate-NMDA-Polyamine NMDA Nmdar1 | phencyclidine
Type:
Enzyme Catalytic Domain
Mol. Mass.:
105533.40
Organism:
RAT
Description:
P35439
Residue:
938
  
Inhibitor
Name:
BDBM82270
Synonyms:
CAS_7424-00-2 PCP
Type:
Small organic molecule
Emp. Form.:
C9H10ClNO2
Mol. Mass.:
199.634
SMILES:
NC(Cc1ccc(Cl)cc1)C(O)=O
: