Target
Neuropeptide Y receptor type 2
Ligand
BDBM82292
Substrate
Ki
3.54±n/a nM
Comments
PDSP_1385
Citation
 Gerald, CWalker, MWVaysse, PJHe, CBranchek, TAWeinshank, RL Expression cloning and pharmacological characterization of a human hippocampal neuropeptide Y/peptide YY Y2 receptor subtype. J Biol Chem 270:26758-61 (1995)  
Target
Name:
Neuropeptide Y receptor type 2
Synonyms:
NPY-Y2 NPY2-R NPY2R_HUMAN Y2 receptor | neuropeptide Y receptor Y2
Type:
Enzyme Catalytic Domain
Mol. Mass.:
42734.65
Organism:
Homo sapiens (Human)
Description:
NPY-Y2 NPY2R HUMAN::P49146
Residue:
381
  
Inhibitor
Name:
BDBM82292
Synonyms:
NPY20-36, porcine | NPY26-36, porcine
Type:
Small organic molecule
Emp. Form.:
C103H157N31O25
Mol. Mass.:
2229.5414
SMILES:
CC[C@H](C)[C@H](NC(=O)[C@H](Cc1ccc(O)cc1)NC(=O)[C@H](Cc1cnc[nH]1)NC(=O)[C@H](CCCN=C(N)N)NC(=O)[C@H](CC(C)C)NC(=O)[C@H](C)NC(=O)[C@H](CO)NC(=O)[C@H](Cc1ccc(O)cc1)NC(=O)[C@@H](N)Cc1ccc(O)cc1)C(=O)N[C@@H](CC(N)=O)C(=O)N[C@@H](CC(C)C)C(=O)N[C@@H]([C@@H](C)CC)C(=O)N[C@@H]([C@@H](C)O)C(=O)N[C@@H](CCCN=C(N)N)C(=O)N[C@@H](CCC(N)=O)C(=O)N[C@@H](CCCN=C(N)N)C(=O)N[C@@H](Cc1ccc(O)cc1)C(N)=O
: