Target
5-hydroxytryptamine receptor 7
Ligand
BDBM30704
Substrate
Ki
6.91±n/a nM
Comments
PDSP_1209
Citation
 To, ZPBonhaus, DWEglen, RMJakeman, LB Characterization and distribution of putative 5-ht7 receptors in guinea-pig brain. Br J Pharmacol 115:107-16 (1995)  
Target
Name:
5-hydroxytryptamine receptor 7
Synonyms:
5-HT7 5HT7R_CAVPO Serotonin 7 (5-HT7) receptor
Type:
Enzyme Catalytic Domain
Mol. Mass.:
49632.36
Organism:
GUINEA PIG
Description:
5-HT7 HTR7 GUINEA PIG::P50407
Residue:
446
  
Inhibitor
Name:
BDBM30704
Synonyms:
(phenylmethyl) N-[[(6aR,9S,10aR)-4,7-dimethyl-6,6a,8,9,10,10a-hexahydroindolo[4,3-fg]quinoline-9-yl]methyl]carbamate METERGOLINE N-[[(6aR,9S,10aR)-4,7-dimethyl-6,6a,8,9,10,10a-hexahydroindolo[4,3-fg]quinoline-9-yl]methyl]carbamic acid (phenylmethyl) ester SMR000059050 cid_28693
Type:
Small organic molecule
Emp. Form.:
C25H29N3O2
Mol. Mass.:
403.5167
SMILES:
CN1C[C@H](CNC(=O)OCc2ccccc2)C[C@H]2[C@H]1Cc1cn(C)c3cccc2c13
: