Target
5-hydroxytryptamine receptor 7
Ligand
BDBM79181
Substrate
Ki
1445.43±n/a nM
Comments
PDSP_1908
Citation
 To, ZPBonhaus, DWEglen, RMJakeman, LB Characterization and distribution of putative 5-ht7 receptors in guinea-pig brain. Br J Pharmacol 115:107-16 (1995)  
Target
Name:
5-hydroxytryptamine receptor 7
Synonyms:
5-HT7 5HT7R_CAVPO Serotonin 7 (5-HT7) receptor
Type:
Enzyme Catalytic Domain
Mol. Mass.:
49632.36
Organism:
GUINEA PIG
Description:
5-HT7 HTR7 GUINEA PIG::P50407
Residue:
446
  
Inhibitor
Name:
BDBM79181
Synonyms:
10-[3-(4-methyl-1-piperazinyl)propyl]-2-(trifluoromethyl)phenothiazine;hydrochloride 10-[3-(4-methylpiperazino)propyl]-2-(trifluoromethyl)phenothiazine;hydrochloride SMR000059133 TRIFLUOPERAZINE DIHYDROCHLORIDE US11542290, Compound Trifluoperazine cid_5566
Type:
Small organic molecule
Emp. Form.:
C21H24F3N3S
Mol. Mass.:
407.496
SMILES:
CN1CCN(CCCN2c3ccccc3Sc3ccc(cc23)C(F)(F)F)CC1
: