Target
Gastrin/cholecystokinin type B receptor
Ligand
BDBM82304
Substrate
Ki
0.58±n/a nM
Comments
PDSP_2315
Citation
 Gully, DFréhel, DMarcy, CSpinazzá, ALespy, LNeliat, GMaffrand, JPLe Fur, G Peripheral biological activity of SR 27897: a new potent non-peptide antagonist of CCKA receptors. Eur J Pharmacol 232:13-9 (1993)  
Target
Name:
Gastrin/cholecystokinin type B receptor
Synonyms:
Cckbr Cholecystokinin B receptor GASR_RAT | Gastrin/cholecystokinin type B receptor
Type:
Enzyme Catalytic Domain
Mol. Mass.:
48980.43
Organism:
RAT
Description:
Cholecystokinin A CCKBR RAT::P30553
Residue:
452
  
Inhibitor
Name:
BDBM82304
Synonyms:
CAS_122077 SR 27897
Type:
Small organic molecule
Emp. Form.:
C20H14ClN3O3S
Mol. Mass.:
411.861
SMILES:
OC(=O)Cn1c(cc2ccccc12)C(=O)Nc1nc(cs1)-c1ccccc1Cl
: