Target
Cholecystokinin
Ligand
BDBM81964
Substrate
Ki
24±n/a nM
Comments
PDSP_2215
Citation
 Gully, DFréhel, DMarcy, CSpinazzá, ALespy, LNeliat, GMaffrand, JPLe Fur, G Peripheral biological activity of SR 27897: a new potent non-peptide antagonist of CCKA receptors. Eur J Pharmacol 232:13-9 (1993)  
Target
Name:
Cholecystokinin
Synonyms:
CCK Cholecystokinin B
Type:
Enzyme Catalytic Domain
Mol. Mass.:
12528.64
Organism:
GUINEA PIG
Description:
Cholecystokinin B 0 GUINEA PIG::P01356
Residue:
114
  
Inhibitor
Name:
BDBM81964
Synonyms:
CAS_5486814 NSC_5486814 | Neuromedin C
Type:
Small organic molecule
Emp. Form.:
C50H73N17O11S
Mol. Mass.:
1120.287
SMILES:
CSCCC(NC(=O)C(CC(C)C)NC(=O)C(Cc1cnc[nH]1)NC(=O)CNC(=O)C(NC(=O)C(C)NC(=O)C(Cc1c[nH]c2ccccc12)NC(=O)C(Cc1cnc[nH]1)NC(=O)C(CC(N)=O)NC(=O)CN)C(C)C)C(N)=O
: