Target
Virion infectivity factor
Ligand
BDBM272378
Substrate
Meas. Tech.
HIV Integrase Inhibitory Assay
Temperature
298.15±n/a K
IC50
6.50±n/a nM
Comments
extracted
Citation
 Miyazaki, SBessho, YAdachi, KKawashita, SIsoshima, HOshita, KFukuda, S Substituted thiazoles as HIV integrase inhibitors US Patent  US10065950 Publication Date 9/4/2018 
Target
Name:
Virion infectivity factor
Synonyms:
HIV integrase VIF_HV1N5 inhibitory activity | vif
Type:
Enzyme Catalytic Domain
Mol. Mass.:
22719.51
Organism:
Human immunodeficiency virus type 1 group M subtype B (isolate NY5) (HIV-1)
Description:
P12504
Residue:
192
  
Inhibitor
Name:
BDBM272378
Synonyms:
US10065950, Example 222
Type:
Small organic molecule
Emp. Form.:
C23H24FN3O4S
Mol. Mass.:
457.518
SMILES:
CCOC[C@@H]1Cn2cc(-c3ncc(Cc4ccc(F)cc4)s3)c(=O)c(O)c2C(=O)N1CC
: