Target
5-hydroxytryptamine receptor 5A
Ligand
BDBM30704
Substrate
Ki
1000±n/a nM
Comments
PDSP_1209
Citation
 Erlander, MGLovenberg, TWBaron, BMde Lecea, LDanielson, PERacke, MSlone, ALSiegel, BWFoye, PECannon, K Two members of a distinct subfamily of 5-hydroxytryptamine receptors differentially expressed in rat brain. Proc Natl Acad Sci U S A 90:3452-6 (1993)  
Target
Name:
5-hydroxytryptamine receptor 5A
Synonyms:
5-HT-5A 5-hydroxytryptamine receptor 5A 5ht5a REC17 Serotonin receptor 5A
Type:
Enzyme Catalytic Domain
Mol. Mass.:
40684.21
Organism:
RAT
Description:
5-HT5a HTR5A RAT::P35364
Residue:
357
  
Inhibitor
Name:
BDBM30704
Synonyms:
(phenylmethyl) N-[[(6aR,9S,10aR)-4,7-dimethyl-6,6a,8,9,10,10a-hexahydroindolo[4,3-fg]quinoline-9-yl]methyl]carbamate METERGOLINE N-[[(6aR,9S,10aR)-4,7-dimethyl-6,6a,8,9,10,10a-hexahydroindolo[4,3-fg]quinoline-9-yl]methyl]carbamic acid (phenylmethyl) ester SMR000059050 cid_28693
Type:
Small organic molecule
Emp. Form.:
C25H29N3O2
Mol. Mass.:
403.5167
SMILES:
CN1C[C@H](CNC(=O)OCc2ccccc2)C[C@H]2[C@H]1Cc1cn(C)c3cccc2c13
: