Target
Muscarinic acetylcholine receptor M1
Ligand
BDBM50062598
Substrate
Ki
4.47±n/a nM
Comments
PDSP_2045
Citation
 Lazareno, SBuckley, NJRoberts, FF Characterization of muscarinic M4 binding sites in rabbit lung, chicken heart, and NG108-15 cells. Mol Pharmacol 38:805-15 (1990) Target
Name:
Muscarinic acetylcholine receptor M1
Synonyms:
ACM1_RAT Chrm-1 cholinergic receptor, muscarinic 1
Type:
Enzyme Catalytic Domain
Mol. Mass.:
51390.46
Organism:
RAT
Description:
P08482
Residue:
460
  
Inhibitor
Name:
BDBM50062598
Synonyms:
1-Cyclohexyl-1-phenyl-3-pyrrolidin-1-yl-propan-1-ol KEMADRIN | PROCYCLIDINE
Type:
Small organic molecule
Emp. Form.:
C19H29NO
Mol. Mass.:
287.4397
SMILES:
OC(CCN1CCCC1)(C1CCCCC1)c1ccccc1
: