Target
Muscarinic acetylcholine receptor M1
Ligand
BDBM82371
Substrate
Ki
66.07±n/a nM
Comments
PDSP_1918
Citation
 Lazareno, SBuckley, NJRoberts, FF Characterization of muscarinic M4 binding sites in rabbit lung, chicken heart, and NG108-15 cells. Mol Pharmacol 38:805-15 (1990) Target
Name:
Muscarinic acetylcholine receptor M1
Synonyms:
ACM1_RAT Chrm-1 cholinergic receptor, muscarinic 1
Type:
Enzyme Catalytic Domain
Mol. Mass.:
51390.46
Organism:
RAT
Description:
P08482
Residue:
460
  
Inhibitor
Name:
BDBM82371
Synonyms:
CAS_1508-75-4 TROPICAMIDE
Type:
Small organic molecule
Emp. Form.:
C17H20N2O2
Mol. Mass.:
284.3529
SMILES:
CCN(Cc1ccncc1)C(=O)C(CO)c1ccccc1
: