Target
Muscarinic acetylcholine receptor M3
Ligand
BDBM82379
Substrate
Ki
0.87±n/a nM
Comments
PDSP_3897
Citation
 Lazareno, SBuckley, NJRoberts, FF Characterization of muscarinic M4 binding sites in rabbit lung, chicken heart, and NG108-15 cells. Mol Pharmacol 38:805-15 (1990) Target
Name:
Muscarinic acetylcholine receptor M3
Synonyms:
ACM3_RAT Chrm-3 | Chrm3
Type:
Enzyme Catalytic Domain
Mol. Mass.:
66086.66
Organism:
RAT
Description:
Cholinergic, muscarinic M3 CHRM3 RAT::P08483
Residue:
589
  
Inhibitor
Name:
BDBM82379
Synonyms:
BTM 1042 hydrochloride CAS_87687-13-6
Type:
Small organic molecule
Emp. Form.:
C21H25N3OS
Mol. Mass.:
367.508
SMILES:
CN1CCN(C[C@@H]2[C@@H](Sc3ccccc3NC2=O)c2ccccc2)CC1
: