Target
Muscarinic acetylcholine receptor M3
Ligand
BDBM50062598
Substrate
Ki
7.24±n/a nM
Comments
PDSP_2045
Citation
 Lazareno, SBuckley, NJRoberts, FF Characterization of muscarinic M4 binding sites in rabbit lung, chicken heart, and NG108-15 cells. Mol Pharmacol 38:805-15 (1990) Target
Name:
Muscarinic acetylcholine receptor M3
Synonyms:
ACM3_RAT Chrm-3 | Chrm3
Type:
Enzyme Catalytic Domain
Mol. Mass.:
66086.66
Organism:
RAT
Description:
Cholinergic, muscarinic M3 CHRM3 RAT::P08483
Residue:
589
  
Inhibitor
Name:
BDBM50062598
Synonyms:
1-Cyclohexyl-1-phenyl-3-pyrrolidin-1-yl-propan-1-ol KEMADRIN | PROCYCLIDINE
Type:
Small organic molecule
Emp. Form.:
C19H29NO
Mol. Mass.:
287.4397
SMILES:
OC(CCN1CCCC1)(C1CCCCC1)c1ccccc1
: